ClamWin Free Antivirus Forum Index
ClamWin Free Antivirus
Support and Discussion Forums
Reply to topic
Cannot daily update of virus database
Ichiro


Joined: 19 Feb 2021
Posts: 1
Location: Japan
Reply with quote
When try to update the database, shown the following error message. This issue is continuing over one week. Who could please solve the issue?

Update failed. Your network may be down or none of the mirrors listed in .....
View user's profileSend private message
GuitarBob


Joined: 09 Jul 2006
Posts: 4683
Location: USA
Reply with quote
there are often problems with ClamWin virus database updates due to problems with the mirrors that distribute them. I just set ClamWin to update automatically and it updates when it is able to. If the problem is due to something else, we can't help you. It appears that ClamWin is no longer in development, so any programming errors can't be corrected

Regards,
View user's profileSend private message
Re: Cannot daily update of virus database
adasch


Joined: 04 Dec 2020
Posts: 5
Location: Poland, Gdansk
Reply with quote
Ichiro wrote:
When try to update the database, shown the following error message. This issue is continuing over one week. Who could please solve the issue?

Update failed. Your network may be down or none of the mirrors listed in .....

look at my post in this topic

http://forums.clamwin.com/viewtopic.php?t=5094&start=15

cheers!
View user's profileSend private message
Out
pixi


Joined: 03 Apr 2021
Posts: 2
Reply with quote
Aus und vorbei, clamwin wird es nicht mehr geben.
Alles soll immer umsonst sein, aber keiner spendet...

CLAMWIN is DEAD
View user's profileSend private message
adasch


Joined: 04 Dec 2020
Posts: 5
Location: Poland, Gdansk
Reply with quote
I have new and easy solution

just change mirror address from database.clamav.net to clamav.datev.de (or better but slover clamavdb.c3sl.ufpr.br)

in files FreshClam.conf and ClamWin.conf

Viola!
View user's profileSend private message
GuitarBob


Joined: 09 Jul 2006
Posts: 4683
Location: USA
Reply with quote
Thanks for the information. I am sure it will help someone. Unfortunately, no one can help ClamWin being abandoned.

What we need is someone who can do a Windows port from ClamAV Linix that permanently loads the virus signatures upon startup and then include some heuristics so that it is not too dependent upon the Clam AV signatures. I have some updated heuristics from Clam Sentinel ready to go.

Regards,
View user's profileSend private message
I am facing a same problem
Fojtik


Joined: 26 Mar 2009
Posts: 27
Reply with quote
I am facing a same problem:
Code:
ClamAV update process started at Sat Apr 10 16:48:39 2021
main.cvd is up to date (version: 59, sigs: 4564902, f-level: 60, builder: sigmgr)
WARNING: getpatch: Can't download daily-26136.cdiff from database.clamav.net
WARNING: getpatch: Can't download daily-26136.cdiff from database.clamav.net
WARNING: getpatch: Can't download daily-26136.cdiff from database.clamav.net
WARNING: Can't download daily.cvd from database.clamav.net
Trying again in 5 secs...
ClamAV update process started at Sat Apr 10 16:48:47 2021
main.cvd is up to date (version: 59, sigs: 4564902, f-level: 60, builder: sigmgr)
WARNING: getpatch: Can't download daily-26136.cdiff from database.clamav.net
WARNING: getpatch: Can't download daily-26136.cdiff from database.clamav.net
WARNING: getpatch: Can't download daily-26136.cdiff from database.clamav.net
WARNING: Can't download daily.cvd from database.clamav.net
Trying again in 5 secs...

Contact me on Email, I can help you to build Windows. I simply cannot guess how much work this needs. I cannot send you private message.

PS: It is pretty weird to recompile Clamwin Sad
Code:
1>------ Build started: Project: ZERO_CHECK, Configuration: Debug Win32 ------
1>  Checking Build System
2>------ Build started: Project: json-c, Configuration: Debug Win32 ------
2>  libjson.c
2>O:\Programs\Microsoft Visual Studio 12.0\VC\include\inttypes.h(32): warning C4159: #pragma pack(pop,...) : has popped previously pushed identifier '_CRT_PACKING'
2>O:\Programs\Microsoft Visual Studio 12.0\VC\include\inttypes.h(36): error C2143: syntax error : missing '{' before '__cdecl'
2>O:\Programs\Microsoft Visual Studio 12.0\VC\include\inttypes.h(36): error C2146: syntax error : missing ')' before identifier 'intmax_t'
2>O:\Programs\Microsoft Visual Studio 12.0\VC\include\inttypes.h(36): error C2059: syntax error : ')'
2>O:\Programs\Microsoft Visual Studio 12.0\VC\include\inttypes.h(37): error C2085: '_CRTIMP' : not in formal parameter list
2>O:\Programs\Microsoft Visual Studio 12.0\VC\include\inttypes.h(37): error C2143: syntax error : missing ';' before '__cdecl'
2>O:\Programs\Microsoft Visual Studio 12.0\VC\include\inttypes.h(39): error C2143: syntax error : missing '{' before '__cdecl'
2>O:\Programs\Microsoft Visual Studio 12.0\VC\include\inttypes.h(39): error C2143: syntax error : missing ')' before 'const'
2>O:\Programs\Microsoft Visual Studio 12.0\VC\include\inttypes.h(39): error C2143: syntax error : missing '{' before 'const'
2>O:\Programs\Microsoft Visual Studio 12.0\VC\include\inttypes.h(39): error C2059: syntax error : ','
2>O:\Programs\Microsoft Visual Studio 12.0\VC\include\inttypes.h(39): error C2059: syntax error : ')'
2>O:\Programs\Microsoft Visual Studio 12.0\VC\include\inttypes.h(40): error C2143: syntax error : missing '{' before '__cdecl'
2>O:\Programs\Microsoft Visual Studio 12.0\VC\include\inttypes.h(40): error C2143: syntax error : missing ')' before 'const'
2>O:\Programs\Microsoft Visual Studio 12.0\VC\include\inttypes.h(40): error C2143: syntax error : missing '{' before 'const'
2>O:\Programs\Microsoft Visual Studio 12.0\VC\include\inttypes.h(40): error C2059: syntax error : ','
2>O:\Programs\Microsoft Visual Studio 12.0\VC\include\inttypes.h(40): error C2059: syntax error : ')'
2>O:\Programs\Microsoft Visual Studio 12.0\VC\include\inttypes.h(41): error C2143: syntax error : missing '{' before '__cdecl'
2>O:\Programs\Microsoft Visual Studio 12.0\VC\include\inttypes.h(41): error C2143: syntax error : missing ')' before 'const'
2>O:\Programs\Microsoft Visual Studio 12.0\VC\include\inttypes.h(41): error C2143: syntax error : missing '{' before 'const'
2>O:\Programs\Microsoft Visual Studio 12.0\VC\include\inttypes.h(41): error C2059: syntax error : ','
2>O:\Programs\Microsoft Visual Studio 12.0\VC\include\inttypes.h(41): error C2059: syntax error : ')'
2>O:\Programs\Microsoft Visual Studio 12.0\VC\include\inttypes.h(42): error C2143: syntax error : missing '{' before '__cdecl'
2>O:\Programs\Microsoft Visual Studio 12.0\VC\include\inttypes.h(42): error C2143: syntax error : missing ')' before 'const'
2>O:\Programs\Microsoft Visual Studio 12.0\VC\include\inttypes.h(42): error C2143: syntax error : missing '{' before 'const'
2>O:\Programs\Microsoft Visual Studio 12.0\VC\include\inttypes.h(42): error C2059: syntax error : ','
2>O:\Programs\Microsoft Visual Studio 12.0\VC\include\inttypes.h(42): error C2059: syntax error : ')'
2>O:\Programs\Microsoft Visual Studio 12.0\VC\include\inttypes.h(43): error C2143: syntax error : missing '{' before '__cdecl'
2>O:\Programs\Microsoft Visual Studio 12.0\VC\include\inttypes.h(43): error C2143: syntax error : missing ')' before 'const'
2>O:\Programs\Microsoft Visual Studio 12.0\VC\include\inttypes.h(43): error C2143: syntax error : missing '{' before 'const'
2>O:\Programs\Microsoft Visual Studio 12.0\VC\include\inttypes.h(43): error C2143: syntax error : missing '{' before '*'
2>O:\Programs\Microsoft Visual Studio 12.0\VC\include\inttypes.h(43): error C2059: syntax error : ','
2>O:\Programs\Microsoft Visual Studio 12.0\VC\include\inttypes.h(43): error C2059: syntax error : ')'
2>O:\Programs\Microsoft Visual Studio 12.0\VC\include\inttypes.h(44): error C2143: syntax error : missing '{' before '__cdecl'
2>O:\Programs\Microsoft Visual Studio 12.0\VC\include\inttypes.h(44): error C2143: syntax error : missing ')' before 'const'
2>O:\Programs\Microsoft Visual Studio 12.0\VC\include\inttypes.h(44): error C2143: syntax error : missing '{' before 'const'
2>O:\Programs\Microsoft Visual Studio 12.0\VC\include\inttypes.h(44): error C2143: syntax error : missing '{' before '*'
2>O:\Programs\Microsoft Visual Studio 12.0\VC\include\inttypes.h(44): error C2059: syntax error : ','
2>O:\Programs\Microsoft Visual Studio 12.0\VC\include\inttypes.h(44): error C2059: syntax error : ')'
2>O:\Programs\Microsoft Visual Studio 12.0\VC\include\inttypes.h(45): error C2143: syntax error : missing '{' before '__cdecl'
2>O:\Programs\Microsoft Visual Studio 12.0\VC\include\inttypes.h(45): error C2143: syntax error : missing ')' before 'const'
2>O:\Programs\Microsoft Visual Studio 12.0\VC\include\inttypes.h(45): error C2143: syntax error : missing '{' before 'const'
2>O:\Programs\Microsoft Visual Studio 12.0\VC\include\inttypes.h(45): error C2143: syntax error : missing '{' before '*'
2>O:\Programs\Microsoft Visual Studio 12.0\VC\include\inttypes.h(45): error C2059: syntax error : ','
2>O:\Programs\Microsoft Visual Studio 12.0\VC\include\inttypes.h(45): error C2059: syntax error : ')'
2>O:\Programs\Microsoft Visual Studio 12.0\VC\include\inttypes.h(46): error C2143: syntax error : missing '{' before '__cdecl'
2>O:\Programs\Microsoft Visual Studio 12.0\VC\include\inttypes.h(46): error C2143: syntax error : missing ')' before 'const'
2>O:\Programs\Microsoft Visual Studio 12.0\VC\include\inttypes.h(46): error C2143: syntax error : missing '{' before 'const'
2>O:\Programs\Microsoft Visual Studio 12.0\VC\include\inttypes.h(46): error C2143: syntax error : missing '{' before '*'
2>O:\Programs\Microsoft Visual Studio 12.0\VC\include\inttypes.h(46): error C2059: syntax error : ','
2>O:\Programs\Microsoft Visual Studio 12.0\VC\include\inttypes.h(46): error C2059: syntax error : ')'
3>------ Build started: Project: libclamav, Configuration: Debug Win32 ------
3>  bytecode_api_decl.c
3>  execs.c
3>O:\Programs\Microsoft Visual Studio 12.0\VC\include\inttypes.h(32): warning C4159: #pragma pack(pop,...) : has popped previously pushed identifier '_CRT_PACKING' (..\clamav\libclamav\execs.c)
3>O:\Programs\Microsoft Visual Studio 12.0\VC\include\inttypes.h(32): warning C4159: #pragma pack(pop,...) : has popped previously pushed identifier '_CRT_PACKING' (..\clamav\libclamav\bytecode_api_decl.c)
3>O:\Programs\Microsoft Visual Studio 12.0\VC\include\inttypes.h(36): error C2143: syntax error : missing '{' before '__cdecl' (..\clamav\libclamav\execs.c)
3>O:\Programs\Microsoft Visual Studio 12.0\VC\include\inttypes.h(36): error C2143: syntax error : missing '{' before '__cdecl' (..\clamav\libclamav\bytecode_api_decl.c)
3>O:\Programs\Microsoft Visual Studio 12.0\VC\include\inttypes.h(36): error C2146: syntax error : missing ')' before identifier 'intmax_t' (..\clamav\libclamav\execs.c)
3>O:\Programs\Microsoft Visual Studio 12.0\VC\include\inttypes.h(36): error C2146: syntax error : missing ')' before identifier 'intmax_t' (..\clamav\libclamav\bytecode_api_decl.c)
3>O:\Programs\Microsoft Visual Studio 12.0\VC\include\inttypes.h(36): error C2059: syntax error : ')' (..\clamav\libclamav\execs.c)
3>O:\Programs\Microsoft Visual Studio 12.0\VC\include\inttypes.h(36): error C2059: syntax error : ')' (..\clamav\libclamav\bytecode_api_decl.c)
3>O:\Programs\Microsoft Visual Studio 12.0\VC\include\inttypes.h(37): error C2085: '_CRTIMP' : not in formal parameter list (..\clamav\libclamav\execs.c)
3>O:\Programs\Microsoft Visual Studio 12.0\VC\include\inttypes.h(37): error C2085: '_CRTIMP' : not in formal parameter list (..\clamav\libclamav\bytecode_api_decl.c)
3>O:\Programs\Microsoft Visual Studio 12.0\VC\include\inttypes.h(37): error C2143: syntax error : missing ';' before '__cdecl' (..\clamav\libclamav\execs.c)
3>O:\Programs\Microsoft Visual Studio 12.0\VC\include\inttypes.h(37): error C2143: syntax error : missing ';' before '__cdecl' (..\clamav\libclamav\bytecode_api_decl.c)
3>O:\Programs\Microsoft Visual Studio 12.0\VC\include\inttypes.h(39): error C2143: syntax error : missing '{' before '__cdecl' (..\clamav\libclamav\execs.c)
3>O:\Programs\Microsoft Visual Studio 12.0\VC\include\inttypes.h(39): error C2143: syntax error : missing '{' before '__cdecl' (..\clamav\libclamav\bytecode_api_decl.c)
3>O:\Programs\Microsoft Visual Studio 12.0\VC\include\inttypes.h(39): error C2143: syntax error : missing ')' before 'const' (..\clamav\libclamav\execs.c)
3>O:\Programs\Microsoft Visual Studio 12.0\VC\include\inttypes.h(39): error C2143: syntax error : missing ')' before 'const' (..\clamav\libclamav\bytecode_api_decl.c)
3>O:\Programs\Microsoft Visual Studio 12.0\VC\include\inttypes.h(39): error C2143: syntax error : missing '{' before 'const' (..\clamav\libclamav\execs.c)
3>O:\Programs\Microsoft Visual Studio 12.0\VC\include\inttypes.h(39): error C2143: syntax error : missing '{' before 'const' (..\clamav\libclamav\bytecode_api_decl.c)
3>O:\Programs\Microsoft Visual Studio 12.0\VC\include\inttypes.h(39): error C2059: syntax error : ',' (..\clamav\libclamav\execs.c)
3>O:\Programs\Microsoft Visual Studio 12.0\VC\include\inttypes.h(39): error C2059: syntax error : ',' (..\clamav\libclamav\bytecode_api_decl.c)
3>O:\Programs\Microsoft Visual Studio 12.0\VC\include\inttypes.h(39): error C2059: syntax error : ')' (..\clamav\libclamav\execs.c)
3>O:\Programs\Microsoft Visual Studio 12.0\VC\include\inttypes.h(39): error C2059: syntax error : ')' (..\clamav\libclamav\bytecode_api_decl.c)
3>O:\Programs\Microsoft Visual Studio 12.0\VC\include\inttypes.h(40): error C2143: syntax error : missing '{' before '__cdecl' (..\clamav\libclamav\execs.c)
3>O:\Programs\Microsoft Visual Studio 12.0\VC\include\inttypes.h(40): error C2143: syntax error : missing '{' before '__cdecl' (..\clamav\libclamav\bytecode_api_decl.c)
3>O:\Programs\Microsoft Visual Studio 12.0\VC\include\inttypes.h(40): error C2143: syntax error : missing ')' before 'const' (..\clamav\libclamav\execs.c)
3>O:\Programs\Microsoft Visual Studio 12.0\VC\include\inttypes.h(40): error C2143: syntax error : missing ')' before 'const' (..\clamav\libclamav\bytecode_api_decl.c)
3>O:\Programs\Microsoft Visual Studio 12.0\VC\include\inttypes.h(40): error C2143: syntax error : missing '{' before 'const' (..\clamav\libclamav\execs.c)
3>O:\Programs\Microsoft Visual Studio 12.0\VC\include\inttypes.h(40): error C2143: syntax error : missing '{' before 'const' (..\clamav\libclamav\bytecode_api_decl.c)
3>O:\Programs\Microsoft Visual Studio 12.0\VC\include\inttypes.h(40): error C2059: syntax error : ',' (..\clamav\libclamav\execs.c)
3>O:\Programs\Microsoft Visual Studio 12.0\VC\include\inttypes.h(40): error C2059: syntax error : ',' (..\clamav\libclamav\bytecode_api_decl.c)
3>O:\Programs\Microsoft Visual Studio 12.0\VC\include\inttypes.h(40): error C2059: syntax error : ')' (..\clamav\libclamav\execs.c)
3>O:\Programs\Microsoft Visual Studio 12.0\VC\include\inttypes.h(40): error C2059: syntax error : ')' (..\clamav\libclamav\bytecode_api_decl.c)
3>O:\Programs\Microsoft Visual Studio 12.0\VC\include\inttypes.h(41): error C2143: syntax error : missing '{' before '__cdecl' (..\clamav\libclamav\execs.c)
3>O:\Programs\Microsoft Visual Studio 12.0\VC\include\inttypes.h(41): error C2143: syntax error : missing '{' before '__cdecl' (..\clamav\libclamav\bytecode_api_decl.c)
3>O:\Programs\Microsoft Visual Studio 12.0\VC\include\inttypes.h(41): error C2143: syntax error : missing ')' before 'const' (..\clamav\libclamav\execs.c)
3>O:\Programs\Microsoft Visual Studio 12.0\VC\include\inttypes.h(41): error C2143: syntax error : missing ')' before 'const' (..\clamav\libclamav\bytecode_api_decl.c)
3>O:\Programs\Microsoft Visual Studio 12.0\VC\include\inttypes.h(41): error C2143: syntax error : missing '{' before 'const' (..\clamav\libclamav\execs.c)
3>O:\Programs\Microsoft Visual Studio 12.0\VC\include\inttypes.h(41): error C2143: syntax error : missing '{' before 'const' (..\clamav\libclamav\bytecode_api_decl.c)
3>O:\Programs\Microsoft Visual Studio 12.0\VC\include\inttypes.h(41): error C2059: syntax error : ',' (..\clamav\libclamav\execs.c)
3>O:\Programs\Microsoft Visual Studio 12.0\VC\include\inttypes.h(41): error C2059: syntax error : ',' (..\clamav\libclamav\bytecode_api_decl.c)
3>O:\Programs\Microsoft Visual Studio 12.0\VC\include\inttypes.h(41): error C2059: syntax error : ')' (..\clamav\libclamav\execs.c)
3>O:\Programs\Microsoft Visual Studio 12.0\VC\include\inttypes.h(41): error C2059: syntax error : ')' (..\clamav\libclamav\bytecode_api_decl.c)
3>O:\Programs\Microsoft Visual Studio 12.0\VC\include\inttypes.h(42): error C2143: syntax error : missing '{' before '__cdecl' (..\clamav\libclamav\execs.c)
3>O:\Programs\Microsoft Visual Studio 12.0\VC\include\inttypes.h(42): error C2143: syntax error : missing '{' before '__cdecl' (..\clamav\libclamav\bytecode_api_decl.c)
3>O:\Programs\Microsoft Visual Studio 12.0\VC\include\inttypes.h(42): error C2143: syntax error : missing ')' before 'const' (..\clamav\libclamav\bytecode_api_decl.c)
3>O:\Programs\Microsoft Visual Studio 12.0\VC\include\inttypes.h(42): error C2143: syntax error : missing ')' before 'const' (..\clamav\libclamav\execs.c)
3>O:\Programs\Microsoft Visual Studio 12.0\VC\include\inttypes.h(42): error C2143: syntax error : missing '{' before 'const' (..\clamav\libclamav\bytecode_api_decl.c)
3>O:\Programs\Microsoft Visual Studio 12.0\VC\include\inttypes.h(42): error C2143: syntax error : missing '{' before 'const' (..\clamav\libclamav\execs.c)
3>O:\Programs\Microsoft Visual Studio 12.0\VC\include\inttypes.h(42): error C2059: syntax error : ',' (..\clamav\libclamav\bytecode_api_decl.c)
3>O:\Programs\Microsoft Visual Studio 12.0\VC\include\inttypes.h(42): error C2059: syntax error : ',' (..\clamav\libclamav\execs.c)
3>O:\Programs\Microsoft Visual Studio 12.0\VC\include\inttypes.h(42): error C2059: syntax error : ')' (..\clamav\libclamav\bytecode_api_decl.c)
3>O:\Programs\Microsoft Visual Studio 12.0\VC\include\inttypes.h(42): error C2059: syntax error : ')' (..\clamav\libclamav\execs.c)
3>O:\Programs\Microsoft Visual Studio 12.0\VC\include\inttypes.h(43): error C2143: syntax error : missing '{' before '__cdecl' (..\clamav\libclamav\bytecode_api_decl.c)
3>O:\Programs\Microsoft Visual Studio 12.0\VC\include\inttypes.h(43): error C2143: syntax error : missing '{' before '__cdecl' (..\clamav\libclamav\execs.c)
3>O:\Programs\Microsoft Visual Studio 12.0\VC\include\inttypes.h(43): error C2143: syntax error : missing ')' before 'const' (..\clamav\libclamav\bytecode_api_decl.c)
3>O:\Programs\Microsoft Visual Studio 12.0\VC\include\inttypes.h(43): error C2143: syntax error : missing ')' before 'const' (..\clamav\libclamav\execs.c)
3>O:\Programs\Microsoft Visual Studio 12.0\VC\include\inttypes.h(43): error C2143: syntax error : missing '{' before 'const' (..\clamav\libclamav\bytecode_api_decl.c)
3>O:\Programs\Microsoft Visual Studio 12.0\VC\include\inttypes.h(43): error C2143: syntax error : missing '{' before 'const' (..\clamav\libclamav\execs.c)
3>O:\Programs\Microsoft Visual Studio 12.0\VC\include\inttypes.h(43): error C2143: syntax error : missing '{' before '*' (..\clamav\libclamav\bytecode_api_decl.c)
3>O:\Programs\Microsoft Visual Studio 12.0\VC\include\inttypes.h(43): error C2143: syntax error : missing '{' before '*' (..\clamav\libclamav\execs.c)
3>O:\Programs\Microsoft Visual Studio 12.0\VC\include\inttypes.h(43): error C2059: syntax error : ',' (..\clamav\libclamav\bytecode_api_decl.c)
3>O:\Programs\Microsoft Visual Studio 12.0\VC\include\inttypes.h(43): error C2059: syntax error : ',' (..\clamav\libclamav\execs.c)
3>O:\Programs\Microsoft Visual Studio 12.0\VC\include\inttypes.h(43): error C2059: syntax error : ')' (..\clamav\libclamav\bytecode_api_decl.c)
3>O:\Programs\Microsoft Visual Studio 12.0\VC\include\inttypes.h(43): error C2059: syntax error : ')' (..\clamav\libclamav\execs.c)
3>O:\Programs\Microsoft Visual Studio 12.0\VC\include\inttypes.h(44): error C2143: syntax error : missing '{' before '__cdecl' (..\clamav\libclamav\bytecode_api_decl.c)
3>O:\Programs\Microsoft Visual Studio 12.0\VC\include\inttypes.h(44): error C2143: syntax error : missing '{' before '__cdecl' (..\clamav\libclamav\execs.c)
3>O:\Programs\Microsoft Visual Studio 12.0\VC\include\inttypes.h(44): error C2143: syntax error : missing ')' before 'const' (..\clamav\libclamav\bytecode_api_decl.c)
3>O:\Programs\Microsoft Visual Studio 12.0\VC\include\inttypes.h(44): error C2143: syntax error : missing ')' before 'const' (..\clamav\libclamav\execs.c)
3>O:\Programs\Microsoft Visual Studio 12.0\VC\include\inttypes.h(44): error C2143: syntax error : missing '{' before 'const' (..\clamav\libclamav\bytecode_api_decl.c)
3>O:\Programs\Microsoft Visual Studio 12.0\VC\include\inttypes.h(44): error C2143: syntax error : missing '{' before 'const' (..\clamav\libclamav\execs.c)
3>O:\Programs\Microsoft Visual Studio 12.0\VC\include\inttypes.h(44): error C2143: syntax error : missing '{' before '*' (..\clamav\libclamav\bytecode_api_decl.c)
3>O:\Programs\Microsoft Visual Studio 12.0\VC\include\inttypes.h(44): error C2143: syntax error : missing '{' before '*' (..\clamav\libclamav\execs.c)
3>O:\Programs\Microsoft Visual Studio 12.0\VC\include\inttypes.h(44): error C2059: syntax error : ',' (..\clamav\libclamav\bytecode_api_decl.c)
3>O:\Programs\Microsoft Visual Studio 12.0\VC\include\inttypes.h(44): error C2059: syntax error : ',' (..\clamav\libclamav\execs.c)
3>O:\Programs\Microsoft Visual Studio 12.0\VC\include\inttypes.h(44): error C2059: syntax error : ')' (..\clamav\libclamav\bytecode_api_decl.c)
3>O:\Programs\Microsoft Visual Studio 12.0\VC\include\inttypes.h(44): error C2059: syntax error : ')' (..\clamav\libclamav\execs.c)
3>O:\Programs\Microsoft Visual Studio 12.0\VC\include\inttypes.h(45): error C2143: syntax error : missing '{' before '__cdecl' (..\clamav\libclamav\bytecode_api_decl.c)
3>O:\Programs\Microsoft Visual Studio 12.0\VC\include\inttypes.h(45): error C2143: syntax error : missing '{' before '__cdecl' (..\clamav\libclamav\execs.c)
3>O:\Programs\Microsoft Visual Studio 12.0\VC\include\inttypes.h(45): error C2143: syntax error : missing ')' before 'const' (..\clamav\libclamav\bytecode_api_decl.c)
3>O:\Programs\Microsoft Visual Studio 12.0\VC\include\inttypes.h(45): error C2143: syntax error : missing ')' before 'const' (..\clamav\libclamav\execs.c)
3>O:\Programs\Microsoft Visual Studio 12.0\VC\include\inttypes.h(45): error C2143: syntax error : missing '{' before 'const' (..\clamav\libclamav\bytecode_api_decl.c)
3>O:\Programs\Microsoft Visual Studio 12.0\VC\include\inttypes.h(45): error C2143: syntax error : missing '{' before 'const' (..\clamav\libclamav\execs.c)
3>O:\Programs\Microsoft Visual Studio 12.0\VC\include\inttypes.h(45): error C2143: syntax error : missing '{' before '*' (..\clamav\libclamav\bytecode_api_decl.c)
3>O:\Programs\Microsoft Visual Studio 12.0\VC\include\inttypes.h(45): error C2143: syntax error : missing '{' before '*' (..\clamav\libclamav\execs.c)
3>O:\Programs\Microsoft Visual Studio 12.0\VC\include\inttypes.h(45): error C2059: syntax error : ',' (..\clamav\libclamav\bytecode_api_decl.c)
3>O:\Programs\Microsoft Visual Studio 12.0\VC\include\inttypes.h(45): error C2059: syntax error : ',' (..\clamav\libclamav\execs.c)
3>O:\Programs\Microsoft Visual Studio 12.0\VC\include\inttypes.h(45): error C2059: syntax error : ')' (..\clamav\libclamav\bytecode_api_decl.c)
3>O:\Programs\Microsoft Visual Studio 12.0\VC\include\inttypes.h(45): error C2059: syntax error : ')' (..\clamav\libclamav\execs.c)
3>O:\Programs\Microsoft Visual Studio 12.0\VC\include\inttypes.h(46): error C2143: syntax error : missing '{' before '__cdecl' (..\clamav\libclamav\bytecode_api_decl.c)
3>O:\Programs\Microsoft Visual Studio 12.0\VC\include\inttypes.h(46): error C2143: syntax error : missing '{' before '__cdecl' (..\clamav\libclamav\execs.c)
3>O:\Programs\Microsoft Visual Studio 12.0\VC\include\inttypes.h(46): error C2143: syntax error : missing ')' before 'const' (..\clamav\libclamav\bytecode_api_decl.c)
3>O:\Programs\Microsoft Visual Studio 12.0\VC\include\inttypes.h(46): error C2143: syntax error : missing ')' before 'const' (..\clamav\libclamav\execs.c)
3>O:\Programs\Microsoft Visual Studio 12.0\VC\include\inttypes.h(46): error C2143: syntax error : missing '{' before 'const' (..\clamav\libclamav\bytecode_api_decl.c)
3>O:\Programs\Microsoft Visual Studio 12.0\VC\include\inttypes.h(46): error C2143: syntax error : missing '{' before 'const' (..\clamav\libclamav\execs.c)
3>O:\Programs\Microsoft Visual Studio 12.0\VC\include\inttypes.h(46): error C2143: syntax error : missing '{' before '*' (..\clamav\libclamav\bytecode_api_decl.c)
3>O:\Programs\Microsoft Visual Studio 12.0\VC\include\inttypes.h(46): error C2143: syntax error : missing '{' before '*' (..\clamav\libclamav\execs.c)
3>O:\Programs\Microsoft Visual Studio 12.0\VC\include\inttypes.h(46): error C2059: syntax error : ',' (..\clamav\libclamav\bytecode_api_decl.c)
3>O:\Programs\Microsoft Visual Studio 12.0\VC\include\inttypes.h(46): error C2059: syntax error : ',' (..\clamav\libclamav\execs.c)
3>O:\Programs\Microsoft Visual Studio 12.0\VC\include\inttypes.h(46): error C2059: syntax error : ')' (..\clamav\libclamav\bytecode_api_decl.c)
3>O:\Programs\Microsoft Visual Studio 12.0\VC\include\inttypes.h(46): error C2059: syntax error : ')' (..\clamav\libclamav\execs.c)
3>..\clamav\libclamav\bytecode_api_decl.c(157): fatal error C1903: unable to recover from previous error(s); stopping compilation
4>------ Build started: Project: libfreshclam, Configuration: Debug Win32 ------
5>------ Build started: Project: clamscan, Configuration: Debug Win32 ------
6>------ Build started: Project: clambc, Configuration: Debug Win32 ------
7>------ Build started: Project: clamd, Configuration: Debug Win32 ------
8>------ Build started: Project: clamdscan, Configuration: Debug Win32 ------
9>------ Build started: Project: clamdtop, Configuration: Debug Win32 ------
8>LINK : fatal error LNK1104: cannot open file 'Debug\libclamavd.lib'
6>LINK : fatal error LNK1104: cannot open file 'Debug\libclamavd.lib'
5>LINK : fatal error LNK1104: cannot open file 'Debug\libclamavd.lib'
7>LINK : fatal error LNK1104: cannot open file 'Debug\libclamavd.lib'
10>------ Build started: Project: libclamav_llvm, Configuration: Debug Win32 ------
11>------ Build started: Project: sigtool, Configuration: Debug Win32 ------
9>LINK : fatal error LNK1104: cannot open file 'Debug\libclamavd.lib'
11>LINK : fatal error LNK1104: cannot open file 'Debug\libclamavd.lib'
10>C:\Program Files\MSBuild\Microsoft.Cpp\v4.0\V120\Microsoft.CppBuild.targets(1193,5): warning MSB8012: TargetPath(O:\src\clamav-win32\bin\Debug\libclamav_llvm.dll) does not match the Linker's OutputFile property value (O:\src\clamav-win32\bin\Debug\libclamav_llvmd.dll). This may cause your project to build incorrectly. To correct this, please make sure that $(OutDir), $(TargetName) and $(TargetExt) property values match the value specified in %(Link.OutputFile).
10>C:\Program Files\MSBuild\Microsoft.Cpp\v4.0\V120\Microsoft.CppBuild.targets(1195,5): warning MSB8012: TargetName(libclamav_llvm) does not match the Linker's OutputFile property value (libclamav_llvmd). This may cause your project to build incorrectly. To correct this, please make sure that $(OutDir), $(TargetName) and $(TargetExt) property values match the value specified in %(Link.OutputFile).
10>LINK : fatal error LNK1104: cannot open file 'Debug\libclamavd.lib'
4>C:\Program Files\MSBuild\Microsoft.Cpp\v4.0\V120\Microsoft.CppBuild.targets(1193,5): warning MSB8012: TargetPath(O:\src\clamav-win32\bin\Debug\libfreshclam.dll) does not match the Linker's OutputFile property value (O:\src\clamav-win32\bin\Debug\libfreshclamd.dll). This may cause your project to build incorrectly. To correct this, please make sure that $(OutDir), $(TargetName) and $(TargetExt) property values match the value specified in %(Link.OutputFile).
4>C:\Program Files\MSBuild\Microsoft.Cpp\v4.0\V120\Microsoft.CppBuild.targets(1195,5): warning MSB8012: TargetName(libfreshclam) does not match the Linker's OutputFile property value (libfreshclamd). This may cause your project to build incorrectly. To correct this, please make sure that $(OutDir), $(TargetName) and $(TargetExt) property values match the value specified in %(Link.OutputFile).
4>LINK : fatal error LNK1104: cannot open file 'Debug\libclamavd.lib'
12>------ Build started: Project: freshclam, Configuration: Debug Win32 ------
12>LINK : fatal error LNK1104: cannot open file 'Debug\libfreshclamd.lib'
13>------ Skipped Build: Project: INSTALL, Configuration: Debug Win32 ------
13>Project not selected to build for this solution configuration
========== Build: 1 succeeded, 11 failed, 11 up-to-date, 1 skipped ==========
View user's profileSend private message
GuitarBob


Joined: 09 Jul 2006
Posts: 4683
Location: USA
Reply with quote
You may be able to get ClamWin recompile instructions from Sherpya, the other developers. He prepares the Windows ports used by Alch to recompile. As far as I know, Alch was the only one who did the recompiles.

Regards,
View user's profileSend private message
Cannot daily update of virus database
You cannot post new topics in this forum
You cannot reply to topics in this forum
You cannot edit your posts in this forum
You cannot delete your posts in this forum
You cannot vote in polls in this forum
All times are GMT  
Page 1 of 1  

  
  
 Reply to topic